Target
Plasminogen activator inhibitor 1
Ligand
BDBM50104511
Substrate
Meas. Tech.
ChEBML_155616
IC50
520±n/a nM
Citation
 Folkes, ARoe, MBSohal, SGolec, JFaint, RBrooks, TCharlton, P Synthesis and in vitro evaluation of a series of diketopiperazine inhibitors of plasminogen activator inhibitor-1. Bioorg Med Chem Lett 11:2589-92 (2001)  
Target
Name:
Plasminogen activator inhibitor 1
Synonyms:
Endothelial plasminogen activator inhibitor PAI-1 PAI1_HUMAN Plasminogen activator inhibitor 1 Plasminogen activator inhibitor-1 SERPINE1
Type:
Enzyme
Mol. Mass.:
45064.00
Organism:
Homo sapiens (Human)
Description:
P05121
Residue:
402
  
Inhibitor
Name:
BDBM50104511
Synonyms:
7-{4-[3,6-Dioxo-5-[1-{4-[(thiophene-2-carbonyl)-amino]-phenyl}-meth-(Z)-ylidene]-piperazin-(2Z)-ylidenemethyl]-phenylcarbamoyl}-heptanoic acid | CHEMBL86470
Type:
Small organic molecule
Emp. Form.:
C31H30N4O6S
Mol. Mass.:
586.658
SMILES:
OC(=O)CCCCCCC(=O)Nc1ccc(\C=c2/[nH]c(=O)\c(=C\c3ccc(NC(=O)c4cccs4)cc3)[nH]c2=O)cc1
: