Target
Interstitial collagenase
Ligand
BDBM50096463
Substrate
Meas. Tech.
ChEBML_106281
IC50
143±n/a nM
Citation
 Levin, JIGu, YNelson, FCZask, ADiJoseph, JFSharr, MASung, AJin, GCowling, RChanda, PCosmi, SHsiao, CLEdris, WWilhelm, JKillar, LMSkotnicki, JS Heteroaryl and cycloalkyl sulfonamide hydroxamic acid inhibitors of matrix metalloproteinases. Bioorg Med Chem Lett 11:239-42 (2001)  
Target
Name:
Interstitial collagenase
Synonyms:
CLG MMP1 Matrix metalloproteinase-1 | Matrix metalloproteinase-1 (MMP-1)
Type:
Enzyme
Mol. Mass.:
54010.26
Organism:
Homo sapiens (Human)
Description:
P03956
Residue:
469
  
Inhibitor
Name:
BDBM50096463
Synonyms:
CHEMBL70176 N-hydroxy-2-(4-methoxy-N-(pyridin-3-ylmethyl)phenylsulfonamido)-3-methylbenzamide
Type:
Small organic molecule
Emp. Form.:
C21H21N3O5S
Mol. Mass.:
427.474
SMILES:
COc1ccc(cc1)S(=O)(=O)N(Cc1cccnc1)c1c(C)cccc1C(=O)NO
: