Target
Kappa-type opioid receptor
Ligand
BDBM50451303
Substrate
Meas. Tech.
ChEMBL_146510 (CHEMBL754619)
Ki
0.650000±n/a nM
Citation
 Neumeyer, JLGu, XHvan Vliet, LADeNunzio, NJRusovici, DECohen, DJNegus, SSMello, NKBidlack, JM Mixed kappa agonists and mu agonists/antagonists as potential pharmacotherapeutics for cocaine abuse: synthesis and opioid receptor binding affinity of N-substituted derivatives of morphinan. Bioorg Med Chem Lett 11:2735-40 (2001)  
Target
Name:
Kappa-type opioid receptor
Synonyms:
Kappa Opioid Receptor OPRK1 Opiate Kappa 1 | mu/kappa opioid receptor
Type:
G Protein-Coupled Receptor (GPCR)
Mol. Mass.:
42744.99
Organism:
Cavia porcellus (domestic guinea pig)
Description:
P41144
Residue:
380
  
Inhibitor
Name:
BDBM50451303
Synonyms:
CHEMBL2114257 | MCL-116
Type:
Small organic molecule
Emp. Form.:
C19H24INO
Mol. Mass.:
409.3044
SMILES:
[H][C@@]12Cc3cc(O)ccc3[C@]3(CCCC[C@@]13[H])CCN2C\C=C/I
: