Target
Mu-type opioid receptor
Ligand
BDBM50451302
Substrate
Meas. Tech.
ChEBML_145282
Ki
0.004800±n/a nM
Citation
 Neumeyer, JLGu, XHvan Vliet, LADeNunzio, NJRusovici, DECohen, DJNegus, SSMello, NKBidlack, JM Mixed kappa agonists and mu agonists/antagonists as potential pharmacotherapeutics for cocaine abuse: synthesis and opioid receptor binding affinity of N-substituted derivatives of morphinan. Bioorg Med Chem Lett 11:2735-40 (2001)  
Target
Name:
Mu-type opioid receptor
Synonyms:
M-OR-1 Mu opioid receptor OPIATE Mu OPRM_CAVPO
Type:
Enzyme Catalytic Domain
Mol. Mass.:
11165.58
Organism:
GUINEA PIG
Description:
P97266
Residue:
98
  
Inhibitor
Name:
BDBM50451302
Synonyms:
CHEMBL2115245
Type:
Small organic molecule
Emp. Form.:
C19H24INO
Mol. Mass.:
409.3044
SMILES:
[H][C@@]12Cc3cc(O)ccc3[C@]3(CCCC[C@@]13[H])CCN2C\C=C\I
: