Target
Mu-type opioid receptor
Ligand
BDBM50105493
Substrate
Meas. Tech.
ChEBML_145282
Ki
0.280000±n/a nM
Citation
 Neumeyer, JLGu, XHvan Vliet, LADeNunzio, NJRusovici, DECohen, DJNegus, SSMello, NKBidlack, JM Mixed kappa agonists and mu agonists/antagonists as potential pharmacotherapeutics for cocaine abuse: synthesis and opioid receptor binding affinity of N-substituted derivatives of morphinan. Bioorg Med Chem Lett 11:2735-40 (2001)  
Target
Name:
Mu-type opioid receptor
Synonyms:
M-OR-1 Mu opioid receptor OPIATE Mu OPRM_CAVPO
Type:
Enzyme Catalytic Domain
Mol. Mass.:
11165.58
Organism:
GUINEA PIG
Description:
P97266
Residue:
98
  
Inhibitor
Name:
BDBM50105493
Synonyms:
1-(2-furyl)-3-[5-hydroxy-(1R,9R,10R)-17-azatetracyclo[7.5.3.01,10.02,7]heptadeca-2(7),3,5-trien-17-yl]-1-propanone MCL-123
Type:
Small organic molecule
Emp. Form.:
C23H27NO3
Mol. Mass.:
365.4654
SMILES:
Oc1ccc2c(C[C@@H]3[C@@H]4CCCCC24CCN3CCC(=O)c2ccco2)c1
: