Target
Kappa-type opioid receptor
Ligand
BDBM50105498
Substrate
Meas. Tech.
ChEBML_146519
Ki
0.083000±n/a nM
Citation
 Neumeyer, JLGu, XHvan Vliet, LADeNunzio, NJRusovici, DECohen, DJNegus, SSMello, NKBidlack, JM Mixed kappa agonists and mu agonists/antagonists as potential pharmacotherapeutics for cocaine abuse: synthesis and opioid receptor binding affinity of N-substituted derivatives of morphinan. Bioorg Med Chem Lett 11:2735-40 (2001)  
Target
Name:
Kappa-type opioid receptor
Synonyms:
Kappa Opioid Receptor OPRK1 Opiate Kappa 1 | mu/kappa opioid receptor
Type:
G Protein-Coupled Receptor (GPCR)
Mol. Mass.:
42744.99
Organism:
Cavia porcellus (domestic guinea pig)
Description:
P41144
Residue:
380
  
Inhibitor
Name:
BDBM50105498
Synonyms:
17-(3-fluoropropyl)-(1R,9R,10R)-17-azatetracyclo[7.5.3.01,10.02,7]heptadeca-2(7),3,5-trien-5-ol | CHEMBL419511
Type:
Small organic molecule
Emp. Form.:
C19H26FNO
Mol. Mass.:
303.4142
SMILES:
Oc1ccc2c(C[C@@H]3[C@@H]4CCCCC24CCN3CCCF)c1
: