Target
Neuronal acetylcholine receptor subunit alpha-7
Ligand
BDBM85330
Substrate
Meas. Tech.
ChEBML_144033
Ki
>3000±n/a nM
Citation
 Macor, JEGurley, DLanthorn, TLoch, JMack, RAMullen, GTran, OWright, NGordon, JC The 5-HT3 antagonist tropisetron (ICS 205-930) is a potent and selective alpha7 nicotinic receptor partial agonist. Bioorg Med Chem Lett 11:319-21 (2001)  
Target
Name:
Neuronal acetylcholine receptor subunit alpha-7
Synonyms:
ACHA7_MOUSE Chrna7 Neuronal nicotinic acetylcholine receptor
Type:
PROTEIN
Mol. Mass.:
56632.61
Organism:
Mus musculus
Description:
ChEMBL_144033
Residue:
502
  
Inhibitor
Name:
BDBM85330
Synonyms:
CAS_68647 ONDANSETRON | Ondansetron hydrochloride
Type:
Small organic molecule
Emp. Form.:
C18H19N3O
Mol. Mass.:
293.363
SMILES:
Cc1nccn1CC1CCc2c(C1=O)c1ccccc1n2C
: