Target
Sodium-dependent serotonin transporter
Ligand
BDBM50097919
Substrate
Meas. Tech.
ChEBML_201502
IC50
>100000±n/a nM
Citation
 Simoni, DRoberti, MRondanin, RBaruchello, RRossi, MInvidiata, FPMerighi, SVarani, KGessi, SBorea, PAMarino, SCavallini, SBianchi, CSiniscalchi, A Effects of two-carbon bridge region methoxylation of benztropine: discovery of novel chiral ligands for the dopamine transporter. Bioorg Med Chem Lett 11:823-7 (2001)  
Target
Name:
Sodium-dependent serotonin transporter
Synonyms:
5-HT Transporter 5HT transporter Anandamid membrane transporter, AMT Monoamine transporters; Norepinephrine & serotonin Slc6a4 Sodium-dependent serotonin transporter (SERT) | imipramine receptor
Type:
Multi-pass membrane protein
Mol. Mass.:
70168.43
Organism:
Rattus norvegicus (rat)
Description:
P31652
Residue:
630
  
Inhibitor
Name:
BDBM50097919
Synonyms:
(3S,6S)-3-[Bis-(4-fluoro-phenyl)-methoxy]-6-methoxy-8-methyl-8-aza-bicyclo[3.2.1]octane | CHEMBL355286
Type:
Small organic molecule
Emp. Form.:
C22H25F2NO2
Mol. Mass.:
373.4362
SMILES:
CO[C@H]1CC2C[C@@H](CC1N2C)OC(c1ccc(F)cc1)c1ccc(F)cc1
: