Target
Somatostatin receptor type 3
Ligand
BDBM50099179
Substrate
Meas. Tech.
ChEBML_225194
Ki
36±n/a nM
Citation
 Moinet, CContour-Galcéra, MOPoitout, LMorgan, BGordon, TRouber, PThurieau, C Novel non-peptide ligands for the somatostatin sst3 receptor. Bioorg Med Chem Lett 11:991-5 (2001)  
Target
Name:
Somatostatin receptor type 3
Synonyms:
SOMATOSTATIN SST3 SS3-R SSR-28 SSTR3 | Somatostatin receptor type 3 (SSTR3)
Type:
Protein
Mol. Mass.:
45855.97
Organism:
Homo sapiens (Human)
Description:
P32745
Residue:
418
  
Inhibitor
Name:
BDBM50099179
Synonyms:
CHEMBL368334 | N-[(R)-2-(1H-Indol-3-yl)-1-(4-phenyl-1H-imidazol-2-yl)-ethyl]-4-methoxy-benzamidine
Type:
Small organic molecule
Emp. Form.:
C27H25N5O
Mol. Mass.:
435.5203
SMILES:
COc1ccc(cc1)C(N)=N[C@H](Cc1c[nH]c2ccccc12)c1nc(c[nH]1)-c1ccccc1
: