Target
Alpha-1B adrenergic receptor
Ligand
BDBM50099325
Substrate
Meas. Tech.
ChEBML_34336
Ki
9.1±n/a nM
Citation
 Carroll, WASippy, KBEsbenshade, TABuckner, SAHancock, AAMeyer, MD Two novel and potent 3-[(o-methoxyphenyl)piperazinylethyl]-5-phenylthien. Bioorg Med Chem Lett 11:1119-21 (2001)  
Target
Name:
Alpha-1B adrenergic receptor
Synonyms:
ADA1B_HUMAN Adrenergic alpha1B Adrenergic receptor alpha Alpha 1B-adrenoreceptor | Alpha-1B adrenergic receptor
Type:
Enzyme
Mol. Mass.:
56862.13
Organism:
Homo sapiens (Human)
Description:
P35368
Residue:
520
  
Inhibitor
Name:
BDBM50099325
Synonyms:
3-{2-[4-(2-Methoxy-phenyl)-piperazin-1-yl]-ethyl}-5-m-tolyl-1H-thieno[2,3-d]pyrimidine-2,4-dione CHEMBL13856
Type:
Small organic molecule
Emp. Form.:
C26H28N4O3S
Mol. Mass.:
476.591
SMILES:
COc1ccccc1N1CCN(CCn2c(=O)[nH]c3scc(-c4cccc(C)c4)c3c2=O)CC1
: