Target
Acetylcholinesterase
Ligand
BDBM50113645
Substrate
Meas. Tech.
ChEBML_27825
Ki
220±n/a nM
Citation
 Rajendran, VSaxena, ADoctor, BPKozikowski, AP Synthesis of more potent analogues of the acetylcholinesterase inhibitor, huperzine B. Bioorg Med Chem Lett 12:1521-3 (2002)  
Target
Name:
Acetylcholinesterase
Synonyms:
ACES_BOVIN Acetylcholinesterase (AChE) | Acetylcholinesterase precursor
Type:
Enzyme
Mol. Mass.:
67659.62
Organism:
Bos taurus (bovine)
Description:
Residue:
613
  
Inhibitor
Name:
BDBM50113645
Synonyms:
CHEMBL39918 | Huperzine Analogue
Type:
Small organic molecule
Emp. Form.:
C16H18N2O
Mol. Mass.:
254.3269
SMILES:
CC1=C2C3Cc4[nH]c(=O)ccc4C2(CC(C)=C3)NC1
: