Target
Beta-lactamase
Ligand
BDBM50112051
Substrate
Meas. Tech.
ChEBML_47853
IC50
5000±n/a nM
Citation
 Copar, APrevec, TAnzic, BMesar, TSelic, LVilar, MSolmajer, T Design, synthesis and bioactivity evaluation of tribactam beta lactamase inhibitors. Bioorg Med Chem Lett 12:971-5 (2002)  
Target
Name:
Beta-lactamase
Synonyms:
Beta-lactamase class C
Type:
PROTEIN
Mol. Mass.:
41618.07
Organism:
Enterobacter cloacae
Description:
ChEMBL_47855
Residue:
384
  
Inhibitor
Name:
BDBM50112051
Synonyms:
CHEMBL175015 | Sodium; (S)-2-eth-(E)-ylidene-1-oxo-2,2a,2b,3,5,6-hexahydro-1H-4-thia-7a-aza-cyclobuta[a]indene-7-carboxylate
Type:
Small organic molecule
Emp. Form.:
C12H12NO3S
Mol. Mass.:
250.294
SMILES:
C\C=C1/[C@@H]2C3CSCCC3=C(N2C1=O)C([O-])=O
: