Target
Progesterone receptor
Ligand
BDBM18627
Substrate
Meas. Tech.
ChEMBL_159384 (CHEMBL768817)
IC50
0.300000±n/a nM
Citation
 Zhi, LTegley, CMPio, BEdwards, JPJones, TKMarschke, KBMais, DERisek, BSchrader, WT Synthesis and biological activity of 5-methylidene 1,2-dihydrochromeno[3,4-f]quinoline derivatives as progesterone receptor modulators. Bioorg Med Chem Lett 13:2071-4 (2003)  
Target
Name:
Progesterone receptor
Synonyms:
NR3C3 PGR PRGR_HUMAN | progesterone
Type:
Protein
Mol. Mass.:
98979.52
Organism:
Homo sapiens (Human)
Description:
P06401
Residue:
933
  
Inhibitor
Name:
BDBM18627
Synonyms:
(10S,11S,14S,15S,17R)-17-[4-(dimethylamino)phenyl]-14-hydroxy-15-methyl-14-(prop-1-yn-1-yl)tetracyclo[8.7.0.0^{2,7}.0^{11,15}]heptadeca-1,6-dien-5-one Mifepristone RU486 (tetramethyl-rhodamine conjugated)
Type:
Small organic molecule
Emp. Form.:
C29H35NO2
Mol. Mass.:
429.5937
SMILES:
[H][C@@]12CC[C@@](O)(C#CC)[C@@]1(C)C[C@@H](C1=C3CCC(=O)C=C3CC[C@@]21[H])c1ccc(cc1)N(C)C
: