Target
Potassium voltage-gated channel subfamily H member 2
Ligand
BDBM22890
Substrate
Meas. Tech.
ChEMBL_158540 (CHEMBL766814)
IC50
30200±n/a nM
Citation
 Keserü, GM Prediction of hERG potassium channel affinity by traditional and hologram qSAR methods. Bioorg Med Chem Lett 13:2773-5 (2003)  
Target
Name:
Potassium voltage-gated channel subfamily H member 2
Synonyms:
1,3-beta-glucan synthase component GLS2 ERG Eag-related protein 1 Ether-a-go-go-related gene (HERG) Ether-a-go-go-related gene potassium channel 1 Ether-a-go-go-related gene potassium channel 1 (hERG1) Ether-a-go-go-related protein 1 H-ERG KCNH2 Potassium voltage-gated channel subfamily H member 2 (hERG) Voltage-gated potassium channel subunit Kv11.1 hERG Potassium Channel 1 | putative potassium channel subunit
Type:
Multi-pass membrane protein
Mol. Mass.:
126672.65
Organism:
Homo sapiens (Human)
Description:
Q12809
Residue:
1159
  
Inhibitor
Name:
BDBM22890
Synonyms:
2-(2-{4-[(4-chlorophenyl)(phenyl)methyl]piperazin-1-yl}ethoxy)acetic acid Cetirizine | Levocetirizine
Type:
Small organic molecule
Emp. Form.:
C21H25ClN2O3
Mol. Mass.:
388.888
SMILES:
OC(=O)COCCN1CCN(CC1)C(c1ccccc1)c1ccc(Cl)cc1
: