Target
Potassium voltage-gated channel subfamily H member 2
Ligand
BDBM50016980
Substrate
Meas. Tech.
ChEMBL_158540 (CHEMBL766814)
IC50
1096±n/a nM
Citation
 Keserü, GM Prediction of hERG potassium channel affinity by traditional and hologram qSAR methods. Bioorg Med Chem Lett 13:2773-5 (2003)  
Target
Name:
Potassium voltage-gated channel subfamily H member 2
Synonyms:
1,3-beta-glucan synthase component GLS2 ERG Eag-related protein 1 Ether-a-go-go-related gene (HERG) Ether-a-go-go-related gene potassium channel 1 Ether-a-go-go-related gene potassium channel 1 (hERG1) Ether-a-go-go-related protein 1 H-ERG KCNH2 Potassium voltage-gated channel subfamily H member 2 (hERG) Voltage-gated potassium channel subunit Kv11.1 hERG Potassium Channel 1 | putative potassium channel subunit
Type:
Multi-pass membrane protein
Mol. Mass.:
126672.65
Organism:
Homo sapiens (Human)
Description:
Q12809
Residue:
1159
  
Inhibitor
Name:
BDBM50016980
Synonyms:
6-(4-(3,4-dimethoxybenzoyl)piperazin-1-yl)-3,4-dihydroquinolin-2(1H)-one 6-[4-(3,4-Dimethoxy-benzoyl)-piperazin-1-yl]-3,4-dihydro-1H-quinolin-2-one(OPC-8212) VESNARINONE | [4-(3,4-Dihydro-quinolin-6-yl)-piperazin-1-yl]-(3,4-dimethoxy-phenyl)-methanone
Type:
Small organic molecule
Emp. Form.:
C22H25N3O4
Mol. Mass.:
395.4516
SMILES:
COc1ccc(cc1OC)C(=O)N1CCN(CC1)c1ccc2NC(=O)CCc2c1
: