Target
Carbonic anhydrase 2
Ligand
BDBM10881
Substrate
Meas. Tech.
ChEBML_45085
Ki
9±n/a nM
Citation
 Casini, AScozzafava, AMincione, FMenabuoni, LStarnotti, MSupuran, CT Carbonic anhydrase inhibitors: topically acting antiglaucoma sulfonamides incorporating esters and amides of 3- and 4-carboxybenzolamide. Bioorg Med Chem Lett 13:2867-73 (2003)  
Target
Name:
Carbonic anhydrase 2
Synonyms:
CA-II CAC Carbonate dehydratase II Carbonic anhydrase 2 (CA-II) Carbonic anhydrase C Carbonic anhydrase II (CA-II) Carbonic anhydrase II (hCA II) | Carbonic anhydrase isoenzyme II (hCA II)
Type:
Enzyme
Mol. Mass.:
29250.71
Organism:
Homo sapiens (Human)
Description:
P00918
Residue:
260
  
Inhibitor
Name:
BDBM10881
Synonyms:
CHEMBL288100 Methazolamide Methazolamide, MZA Sulfonamide, 2 sulfonamide 2
Type:
Small organic molecule
Emp. Form.:
C5H8N4O3S2
Mol. Mass.:
236.272
SMILES:
CC(=O)N=c1sc(nn1C)S(N)(=O)=O
: