Target
Cyclin-dependent kinase 1
Ligand
BDBM50132198
Substrate
Meas. Tech.
ChEBML_52680
IC50
14000±n/a nM
Citation
 Moravec, JKrystof, VHanus, JHavlícek, LMoravcová, DFuksová, KKuzma, MLenobel, ROtyepka, MStrnad, M 2,6,8,9-tetrasubstituted purines as new CDK1 inhibitors. Bioorg Med Chem Lett 13:2993-6 (2003)  
Target
Name:
Cyclin-dependent kinase 1
Synonyms:
CDC2 CDK1 CDKN1 Cell division protein kinase 1 P34CDC2 | p34 protein kinase
Type:
Enzyme Subunit
Mol. Mass.:
34101.08
Organism:
Homo sapiens (Human)
Description:
P06493
Residue:
297
  
Inhibitor
Name:
BDBM50132198
Synonyms:
CHEMBL103567 | N*2*-(4-Amino-cyclohexyl)-N*6*-(3-chloro-phenyl)-9-isopropyl-8-methyl-9H-purine-2,6-diamine
Type:
Small organic molecule
Emp. Form.:
C21H28ClN7
Mol. Mass.:
413.947
SMILES:
CC(C)n1c(C)nc2c(Nc3cccc(Cl)c3)nc(NC3CCC(N)CC3)nc12
: