Target
Prostacyclin receptor
Ligand
BDBM50125407
Substrate
Meas. Tech.
ChEBML_158022
Ki
>13000±n/a nM
Citation
 Billot, XChateauneuf, AChauret, NDenis, DGreig, GMathieu, MCMetters, KMSlipetz, DMYoung, RN Discovery of a potent and selective agonist of the prostaglandin EP4 receptor. Bioorg Med Chem Lett 13:1129-32 (2003)  
Target
Name:
Prostacyclin receptor
Synonyms:
PGI receptor PRIPR Prostacyclin (IP) Receptor Prostaglandin I Prostaglandin I2 receptor | Prostanoid IP receptor
Type:
G Protein-Coupled Receptor (GPCR)
Mol. Mass.:
40968.22
Organism:
Homo sapiens (Human)
Description:
The membranes prepared from human platelet were used in binding assay.
Residue:
386
  
Inhibitor
Name:
BDBM50125407
Synonyms:
7-[(R)-2-(3-Hydroxy-octyl)-5-oxo-pyrrolidin-1-yl]-heptanoic acid | CHEMBL14286
Type:
Small organic molecule
Emp. Form.:
C19H35NO4
Mol. Mass.:
341.4855
SMILES:
CCCCCC(O)CC[C@@H]1CCC(=O)N1CCCCCCC(O)=O
: