Target
Steryl-sulfatase
Ligand
BDBM50366884
Substrate
Meas. Tech.
ChEMBL_203058 (CHEMBL811562)
Ki
600000±n/a nM
Citation
 Lapierre, JAhmed, VChen, MJIspahany, MGuillemette, JGTaylor, SD The difluoromethylene group as a replacement for the labile oxygen in steroid sulfates: a new approach to steroid sulfatase inhibitors. Bioorg Med Chem Lett 14:151-5 (2003)  
Target
Name:
Steryl-sulfatase
Synonyms:
ARSC1 Arylsulfatase C STS_HUMAN Steryl-sulfate sulfohydrolase
Type:
Enzyme
Mol. Mass.:
65503.66
Organism:
Homo sapiens (Human)
Description:
P08842
Residue:
583
  
Inhibitor
Name:
BDBM50366884
Synonyms:
CHEMBL1628109
Type:
Small organic molecule
Emp. Form.:
C19H24O4S
Mol. Mass.:
348.456
SMILES:
C[C@]12CC[C@H]3[C@@H](CCc4cc(CS(O)(=O)=O)ccc34)[C@@H]1CCC2=O
: