Target
Steryl-sulfatase
Ligand
BDBM50366524
Substrate
Meas. Tech.
ChEBML_203055
Ki
60000±n/a nM
Citation
 Lapierre, JAhmed, VChen, MJIspahany, MGuillemette, JGTaylor, SD The difluoromethylene group as a replacement for the labile oxygen in steroid sulfates: a new approach to steroid sulfatase inhibitors. Bioorg Med Chem Lett 14:151-5 (2003)  
Target
Name:
Steryl-sulfatase
Synonyms:
ARSC1 Arylsulfatase C STS_HUMAN Steryl-sulfate sulfohydrolase
Type:
Enzyme
Mol. Mass.:
65503.66
Organism:
Homo sapiens (Human)
Description:
P08842
Residue:
583
  
Inhibitor
Name:
BDBM50366524
Synonyms:
ESTRONE Estrone 3-sulfate | Estrone Sulphate
Type:
Small organic molecule
Emp. Form.:
C18H22O5S
Mol. Mass.:
350.429
SMILES:
C[C@]12CC[C@H]3[C@@H](CCc4cc(OS(O)(=O)=O)ccc34)[C@@H]1CCC2=O
: