Target
Calpain-1 catalytic subunit
Ligand
BDBM50142287
Substrate
Meas. Tech.
ChEBML_43650
IC50
11±n/a nM
Citation
 Bihovsky, RTao, MMallamo, JPWells, GJ 1,2-Benzothiazine 1,1-dioxide alpha-ketoamide analogues as potent calpain I inhibitors. Bioorg Med Chem Lett 14:1035-8 (2004)  
Target
Name:
Calpain-1 catalytic subunit
Synonyms:
CAN1_HUMAN CAPN1 Calpain-1 (u-Calpain) Calpain1
Type:
Protein
Mol. Mass.:
81880.51
Organism:
Homo sapiens (Human)
Description:
Residue:
714
  
Inhibitor
Name:
BDBM50142287
Synonyms:
(S)-2-((S)-2-Amino-3-methyl-butyrylamino)-3-phenyl-propionic acid | CHEMBL8486
Type:
Small organic molecule
Emp. Form.:
C14H20N2O3
Mol. Mass.:
264.3202
SMILES:
CC(C)[C@H](N)C(=O)N[C@@H](Cc1ccccc1)C(O)=O
: