Target
Calpain-1 catalytic subunit
Ligand
BDBM50142302
Substrate
Meas. Tech.
ChEMBL_43652 (CHEMBL654078)
IC50
5±n/a nM
Citation
 Bihovsky, RTao, MMallamo, JPWells, GJ 1,2-Benzothiazine 1,1-dioxide alpha-ketoamide analogues as potent calpain I inhibitors. Bioorg Med Chem Lett 14:1035-8 (2004)  
Target
Name:
Calpain-1 catalytic subunit
Synonyms:
CAN1_HUMAN CAPN1 Calpain-1 (u-Calpain) Calpain1
Type:
Protein
Mol. Mass.:
81880.51
Organism:
Homo sapiens (Human)
Description:
Residue:
714
  
Inhibitor
Name:
BDBM50142302
Synonyms:
6-Chloro-2-ethyl-1,1-dioxo-1,2,3,4-tetrahydro-1lambda*6*-benzo[e][1,2]thiazine-3-carboxylic acid ((S)-1-benzyl-2-oxo-ethyl)-amide | CHEMBL8378
Type:
Small organic molecule
Emp. Form.:
C20H21ClN2O4S
Mol. Mass.:
420.91
SMILES:
CCN1C(Cc2cc(Cl)ccc2S1(=O)=O)C(=O)N[C@@H](Cc1ccccc1)C=O
: