Target
Neuronal acetylcholine receptor subunit alpha-2/beta-2
Ligand
BDBM50143282
Substrate
Meas. Tech.
ChEMBL_143227 (CHEMBL750088)
Ki
1.4±n/a nM
Citation
 Xiao, YBaydyuk, MWang, HPDavis, HEKellar, KJ Pharmacology of the agonist binding sites of rat neuronal nicotinic receptor subtypes expressed in HEK 293 cells. Bioorg Med Chem Lett 14:1845-8 (2004)  
Target
Name:
Neuronal acetylcholine receptor subunit alpha-2/beta-2
Synonyms:
Neuronal acetylcholine receptor protein alpha-2/beta-2 subunit nAChR subtypes alpha2 beta2
Type:
Mol. Mass.:
Description:
ASSAY_ID of EBI is 143226
Components:
This complex has 2 components.
Component 1
Name:
Neuronal acetylcholine receptor subunit alpha-2
Synonyms:
ACHA2_RAT Cholinergic, Nicotinic Alpha2Beta2 Chrna2
Type:
Enzyme
Mol. Mass.:
58597.25
Organism:
Rattus norvegicus (Rat)
Description:
P12389
Residue:
511
  
Component 2
Name:
Neuronal acetylcholine receptor subunit beta-2
Synonyms:
ACHB2_RAT Chrnb2 Neuronal acetylcholine receptor non-alpha-1 chain
Type:
Enzyme
Mol. Mass.:
56910.32
Organism:
Rattus norvegicus (Rat)
Description:
P12390
Residue:
500
  
Inhibitor
Name:
BDBM50143282
Synonyms:
(-)-cytisine (1R,9R)-7,11-diazatricyclo[7.3.1.0~2,7~]trideca-2,4-dien-6-one (1R,9S)-7,11-diazatricyclo[7.3.1.0~2,7~]trideca-2,4-dien-6-one 1,2,3,4,5,6-Hexahydro-1,5-methano-pyrido[1,2-a][1,5]diazocin-8-one CHEMBL497939 cytisine
Type:
Small organic molecule
Emp. Form.:
C11H14N2O
Mol. Mass.:
190.2417
SMILES:
O=c1cccc2[C@H]3CNC[C@H](C3)Cn12
: