Target
Tryptase beta-2/delta/gamma
Ligand
BDBM50144584
Substrate
Meas. Tech.
ChEMBL_210691 (CHEMBL817289)
IC50
14±n/a nM
Citation
 Sutton, JCBolton, SADavis, MEHartl, KSJacobson, BMathur, AOgletree, MLSlusarchyk, WAZahler, RSeiler, SMBisacchi, GS Solid-phase synthesis and SAR of 4-carboxy-2-azetidinone mechanism-based tryptase inhibitors. Bioorg Med Chem Lett 14:2233-9 (2004)  
Target
Name:
Tryptase beta-2/delta/gamma
Synonyms:
Tryptase
Type:
Mol. Mass.:
Description:
ASSAY_ID of ChEMBL is 1510505
Components:
This complex has 3 components.
Component 1
Name:
Tryptase gamma
Synonyms:
PRSS31 TMT TRYG1_HUMAN Tryptase Tryptase gamma heavy chain | Tryptase gamma light chain
Type:
PROTEIN
Mol. Mass.:
33817.52
Organism:
Homo sapiens (Human)
Description:
ChEMBL_210833
Residue:
321
  
Component 2
Name:
Tryptase beta-2
Synonyms:
TPS2 TRYB2_HUMAN Tryptase II Tryptase-2
Type:
PROTEIN
Mol. Mass.:
30518.79
Organism:
Homo sapiens (Human)
Description:
ChEMBL_210702
Residue:
275
  
Component 3
Name:
Tryptase delta
Synonyms:
Delta-tryptase Mast cell mMCP-7-like TRYD_HUMAN Tryptase-3
Type:
PROTEIN
Mol. Mass.:
26578.73
Organism:
Homo sapiens (Human)
Description:
ChEMBL_104777
Residue:
242
  
Inhibitor
Name:
BDBM50144584
Synonyms:
(R)-1-{4-[3-(3-Methoxy-phenyl)-propionyl]-piperazine-1-carbonyl}-4-oxo-3-piperidin-4-ylmethyl-azetidine-2-carboxylic acid | CHEMBL304985
Type:
Small organic molecule
Emp. Form.:
C25H34N4O6
Mol. Mass.:
486.5607
SMILES:
COc1cccc(CCC(=O)N2CCN(CC2)C(=O)N2[C@@H]([C@@H](CC3CCNCC3)C2=O)C(O)=O)c1
: