Target
Carbonic anhydrase 9
Ligand
BDBM50141769
Substrate
Meas. Tech.
ChEBML_45445
Ki
70±n/a nM
Citation
 Pastorekova, SCasini, AScozzafava, AVullo, DPastorek, JSupuran, CT Carbonic anhydrase inhibitors: the first selective, membrane-impermeant inhibitors targeting the tumor-associated isozyme IX. Bioorg Med Chem Lett 14:869-73 (2004)  
Target
Name:
Carbonic anhydrase 9
Synonyms:
CA-IX CAH9_HUMAN Carbonic anhydrase 9 (CA IX) Carbonic anhydrase 9 precursor Carbonic anhydrase IX (CAIX) Carbonic anhydrases; II & IX MN RCC-associated antigen G250
Type:
Enzyme
Mol. Mass.:
49669.03
Organism:
Homo sapiens (Human)
Description:
Catalytic domain of human cloned isozyme was used in the assay
Residue:
459
  
Inhibitor
Name:
BDBM50141769
Synonyms:
2-Ethyl-4,6-diphenyl-1-[2-(4-sulfamoyl-phenyl)-ethyl]-pyridinium; perchlorate | CHEMBL169820
Type:
Small organic molecule
Emp. Form.:
C27H27N2O2S
Mol. Mass.:
443.58
SMILES:
CCc1cc(cc(-c2ccccc2)[n+]1CCc1ccc(cc1)S(N)(=O)=O)-c1ccccc1
: