Target
Carbonic anhydrase 1
Ligand
BDBM50141769
Substrate
Meas. Tech.
ChEBML_47521
Ki
40000±n/a nM
Citation
 Pastorekova, SCasini, AScozzafava, AVullo, DPastorek, JSupuran, CT Carbonic anhydrase inhibitors: the first selective, membrane-impermeant inhibitors targeting the tumor-associated isozyme IX. Bioorg Med Chem Lett 14:869-73 (2004)  
Target
Name:
Carbonic anhydrase 1
Synonyms:
CA-I CAB Carbonate dehydratase I Carbonic anhydrase 1 (CA I) Carbonic anhydrase 1 (Recombinant CA I) Carbonic anhydrase B Carbonic anhydrase I (CA I) Carbonic anhydrase I (CAI) Carbonic anhydrase isoenzyme I (hCA I) | hCA
Type:
Enzyme
Mol. Mass.:
28873.37
Organism:
Homo sapiens (Human)
Description:
P00915
Residue:
261
  
Inhibitor
Name:
BDBM50141769
Synonyms:
2-Ethyl-4,6-diphenyl-1-[2-(4-sulfamoyl-phenyl)-ethyl]-pyridinium; perchlorate | CHEMBL169820
Type:
Small organic molecule
Emp. Form.:
C27H27N2O2S
Mol. Mass.:
443.58
SMILES:
CCc1cc(cc(-c2ccccc2)[n+]1CCc1ccc(cc1)S(N)(=O)=O)-c1ccccc1
: