Target
Carbonic anhydrase 4
Ligand
BDBM50141769
Substrate
Meas. Tech.
ChEBML_45430
Ki
761±n/a nM
Citation
 Pastorekova, SCasini, AScozzafava, AVullo, DPastorek, JSupuran, CT Carbonic anhydrase inhibitors: the first selective, membrane-impermeant inhibitors targeting the tumor-associated isozyme IX. Bioorg Med Chem Lett 14:869-73 (2004)  
Target
Name:
Carbonic anhydrase 4
Synonyms:
CA-IV CAH4_BOVIN Carbonic Anhydrase IV Carbonic anhydrase 4
Type:
Enzyme
Mol. Mass.:
35152.74
Organism:
Bos taurus (bovine)
Description:
Bovine isozyme, isolated from lung microsomes
Residue:
312
  
Inhibitor
Name:
BDBM50141769
Synonyms:
2-Ethyl-4,6-diphenyl-1-[2-(4-sulfamoyl-phenyl)-ethyl]-pyridinium; perchlorate | CHEMBL169820
Type:
Small organic molecule
Emp. Form.:
C27H27N2O2S
Mol. Mass.:
443.58
SMILES:
CCc1cc(cc(-c2ccccc2)[n+]1CCc1ccc(cc1)S(N)(=O)=O)-c1ccccc1
: