Target
Sodium-dependent dopamine transporter
Ligand
BDBM50029144
Substrate
Meas. Tech.
ChEBML_178952
IC50
12000±n/a nM
Citation
 Gueremy, CAudiau, FChampseix, naUzan, ALe Fur, GRataud, J 3-(4-Piperidinylalkyl)indoles, selective inhibitors of neuronal 5-hydroxytryptamine uptake. J Med Chem 23:1306-10 (1981)  
Target
Name:
Sodium-dependent dopamine transporter
Synonyms:
DA transporter SC6A3_RAT Sodium-dependent dopamine transporter | Sodium-dependent dopamine transporter (DAT)
Type:
Multi-pass membrane protein
Mol. Mass.:
68749.45
Organism:
Rattus norvegicus (rat)
Description:
P23977
Residue:
619
  
Inhibitor
Name:
BDBM50029144
Synonyms:
5-Chloro-3-piperidin-4-ylmethyl-1H-indole; 5 moles of fumarate
Type:
Small organic molecule
Emp. Form.:
C14H17ClN2
Mol. Mass.:
248.751
SMILES:
Clc1ccc2[nH]cc(CC3CCNCC3)c2c1
: