Target
Sodium-dependent serotonin transporter
Ligand
BDBM50029144
Substrate
Meas. Tech.
ChEBML_178951
IC50
700±n/a nM
Citation
 Gueremy, CAudiau, FChampseix, naUzan, ALe Fur, GRataud, J 3-(4-Piperidinylalkyl)indoles, selective inhibitors of neuronal 5-hydroxytryptamine uptake. J Med Chem 23:1306-10 (1981)  
Target
Name:
Sodium-dependent serotonin transporter
Synonyms:
5-HT Transporter 5HT transporter Anandamid membrane transporter, AMT Monoamine transporters; Norepinephrine & serotonin Slc6a4 Sodium-dependent serotonin transporter (SERT) | imipramine receptor
Type:
Multi-pass membrane protein
Mol. Mass.:
70168.43
Organism:
Rattus norvegicus (rat)
Description:
P31652
Residue:
630
  
Inhibitor
Name:
BDBM50029144
Synonyms:
5-Chloro-3-piperidin-4-ylmethyl-1H-indole; 5 moles of fumarate
Type:
Small organic molecule
Emp. Form.:
C14H17ClN2
Mol. Mass.:
248.751
SMILES:
Clc1ccc2[nH]cc(CC3CCNCC3)c2c1
: