Target
Cytidine deaminase
Ligand
BDBM50025464
Substrate
Meas. Tech.
ChEMBL_52526 (CHEMBL665298)
Ki
300±n/a nM
Citation
 Liu, PSMarquez, VEDriscoll, JSFuller, RWMcCormack, JJ Cyclic urea nucleosides. Cytidine deaminase activity as a function of aglycon ring size. J Med Chem 24:662-6 (1981)  
Target
Name:
Cytidine deaminase
Synonyms:
CDD_MOUSE Cdd | Cytidine aminohydrolase
Type:
PROTEIN
Mol. Mass.:
16129.75
Organism:
Mus musculus
Description:
ChEMBL_52531
Residue:
146
  
Inhibitor
Name:
BDBM50025464
Synonyms:
1-(3,4-Dihydroxy-5-hydroxymethyl-tetrahydro-furan-2-yl)-[1,3]diazepan-2-one | CHEMBL2367576
Type:
Small organic molecule
Emp. Form.:
C10H18N2O5
Mol. Mass.:
246.2603
SMILES:
OC[C@H]1O[C@H]([C@H](O)[C@@H]1O)N1CCCCNC1=O
: