Target
Cytidine deaminase
Ligand
BDBM50367036
Substrate
Meas. Tech.
ChEBML_52523
Ki
15000±n/a nM
Citation
 Liu, PSMarquez, VEDriscoll, JSFuller, RWMcCormack, JJ Cyclic urea nucleosides. Cytidine deaminase activity as a function of aglycon ring size. J Med Chem 24:662-6 (1981)  
Target
Name:
Cytidine deaminase
Synonyms:
CDA CDD_HUMAN Cytidine deaminase (CDA)
Type:
Ezyme
Mol. Mass.:
16185.04
Organism:
Homo sapiens (Human)
Description:
P32320
Residue:
146
  
Inhibitor
Name:
BDBM50367036
Synonyms:
CHEMBL609349
Type:
Small organic molecule
Emp. Form.:
C11H20N2O5
Mol. Mass.:
260.2869
SMILES:
OC[C@H]1OC([C@H](O)[C@@H]1O)N1CCCCCNC1=O
: