Target
Adenylate kinase 2, mitochondrial
Ligand
BDBM50367046
Substrate
Meas. Tech.
ChEBML_32055
Ki
450000±n/a nM
Citation
 Kappler, FHai, TTAbo, MHampton, A Species- or isozyme-specific enzyme inhibitors. 8. Synthesis of disubstituted two-substrate condensation products as inhibitors of rat adenylate kinases. J Med Chem 25:1179-84 (1983)  
Target
Name:
Adenylate kinase 2, mitochondrial
Synonyms:
2.7.4.3 ATP-AMP transphosphorylase 2 Adenylate kinase 2 Adenylate monophosphate kinase KAD2_RAT
Type:
Mol. Mass.:
26380.21
Organism:
Rattus norvegicus
Description:
Residue:
239
  
Inhibitor
Name:
BDBM50367046
Synonyms:
CHEMBL604395
Type:
Small organic molecule
Emp. Form.:
C13H22N5O13P3
Mol. Mass.:
549.2608
SMILES:
CCC[C@@H](OP(O)(=O)OP(O)(=O)OP(O)(O)=O)[C@H]1OC([C@H](O)[C@@H]1O)n1cnc2c(N)ncnc12
: