Target
Phenylethanolamine N-methyltransferase
Ligand
BDBM50367057
Substrate
Meas. Tech.
ChEBML_142787
Ki
379000±n/a nM
Citation
 Grunewald, GLMonn, JARafferty, MFBorchardt, RTKrass, P Probes of the active site of norepinephrine N-methyltransferase: effect of hydrophobic and hydrophilic interactions on side-chain binding of amphetamine and alpha-methylbenzylamine. J Med Chem 25:1248-50 (1983)  
Target
Name:
Phenylethanolamine N-methyltransferase
Synonyms:
Noradrenaline N-methyltransferase PNMT_BOVIN | PNMTase
Type:
Enzyme
Mol. Mass.:
30916.97
Organism:
Bos taurus (bovine)
Description:
Residue:
283
  
Inhibitor
Name:
BDBM50367057
Synonyms:
CHEMBL1235200 | EN300-73161
Type:
Small organic molecule
Emp. Form.:
C9H13NO
Mol. Mass.:
151.2056
SMILES:
N[C@@H](CO)Cc1ccccc1
: