Target
Phenylethanolamine N-methyltransferase
Ligand
BDBM50028646
Substrate
Meas. Tech.
ChEBML_142787
Ki
>1000000±n/a nM
Citation
 Grunewald, GLMonn, JARafferty, MFBorchardt, RTKrass, P Probes of the active site of norepinephrine N-methyltransferase: effect of hydrophobic and hydrophilic interactions on side-chain binding of amphetamine and alpha-methylbenzylamine. J Med Chem 25:1248-50 (1983)  
Target
Name:
Phenylethanolamine N-methyltransferase
Synonyms:
Noradrenaline N-methyltransferase PNMT_BOVIN | PNMTase
Type:
Enzyme
Mol. Mass.:
30916.97
Organism:
Bos taurus (bovine)
Description:
Residue:
283
  
Inhibitor
Name:
BDBM50028646
Synonyms:
1-Phenyl-butylamine | CHEMBL22934
Type:
Small organic molecule
Emp. Form.:
C10H15N
Mol. Mass.:
149.2328
SMILES:
CCCC(N)c1ccccc1
: