Target
Beta-1 adrenergic receptor
Ligand
BDBM25764
Substrate
Meas. Tech.
ChEBML_39161
IC50
4.9±n/a nM
Citation
 Baldwin, JJMcClure, DEGross, DMWilliams, M Use of (S)-(trifloxymethyl)oxirane in the synthesis of a chiral beta-adrenoceptor antagonist, (R)- and (S)-9-[[3-(tert-butylamino)-2-hydroxypropyl]oximino]fluorene. J Med Chem 25:931-6 (1982)  
Target
Name:
Beta-1 adrenergic receptor
Synonyms:
ADRB1 ADRB1_HUMAN Beta-1 adrenoceptor adrenergic Beta1
Type:
G Protein-Coupled Receptor (GPCR)
Mol. Mass.:
51338.40
Organism:
Homo sapiens (Human)
Description:
P08588
Residue:
477
  
Inhibitor
Name:
BDBM25764
Synonyms:
ALPRENOLOL,(+) Alfeprol Alprenolol {2-hydroxy-3-[2-(prop-2-en-1-yl)phenoxy]propyl}(propan-2-yl)amine
Type:
Small organic molecule
Emp. Form.:
C15H23NO2
Mol. Mass.:
249.3486
SMILES:
CC(C)NCC(O)COc1ccccc1CC=C
: