Target
Angiotensin-converting enzyme
Ligand
BDBM50452141
Substrate
Meas. Tech.
ChEMBL_36914 (CHEMBL647115)
IC50
4000±n/a nM
Citation
 Fournié-Zaluski, MCChaillet, PSoroca-Lucas, EMarçais-Collado, HCostentin, JRoques, BP New carboxyalkyl inhibitors of brain enkephalinase: synthesis, biological activity, and analgesic properties. J Med Chem 26:60-5 (1983)  
Target
Name:
Angiotensin-converting enzyme
Synonyms:
ACE_MOUSE Dcp1
Type:
PROTEIN
Mol. Mass.:
150916.88
Organism:
Mus musculus
Description:
ChEMBL_34763
Residue:
1312
  
Inhibitor
Name:
BDBM50452141
Synonyms:
CHEMBL2372595
Type:
Small organic molecule
Emp. Form.:
C14H18N2O5
Mol. Mass.:
294.3031
SMILES:
C[C@H](NC(=O)[C@H](Cc1ccccc1)NCC(O)=O)C(O)=O
: