Target
Angiotensin-converting enzyme
Ligand
BDBM50027513
Substrate
Meas. Tech.
ChEMBL_36914 (CHEMBL647115)
IC50
>100000±n/a nM
Citation
 Fournié-Zaluski, MCChaillet, PSoroca-Lucas, EMarçais-Collado, HCostentin, JRoques, BP New carboxyalkyl inhibitors of brain enkephalinase: synthesis, biological activity, and analgesic properties. J Med Chem 26:60-5 (1983)  
Target
Name:
Angiotensin-converting enzyme
Synonyms:
ACE_MOUSE Dcp1
Type:
PROTEIN
Mol. Mass.:
150916.88
Organism:
Mus musculus
Description:
ChEMBL_34763
Residue:
1312
  
Inhibitor
Name:
BDBM50027513
Synonyms:
2-[2-(2-Carboxy-ethylamino)-3-phenyl-propionylamino]-4-methyl-pentanoic acid
Type:
Small organic molecule
Emp. Form.:
C18H24N2O5
Mol. Mass.:
348.3947
SMILES:
CC(C)CC(NC(=O)C(Cc1ccccc1)NCCC([O-])=O)C([O-])=O
: