Target
Angiotensin-converting enzyme
Ligand
BDBM50027518
Substrate
Meas. Tech.
ChEMBL_36914 (CHEMBL647115)
IC50
2000±n/a nM
Citation
 Fournié-Zaluski, MCChaillet, PSoroca-Lucas, EMarçais-Collado, HCostentin, JRoques, BP New carboxyalkyl inhibitors of brain enkephalinase: synthesis, biological activity, and analgesic properties. J Med Chem 26:60-5 (1983)  
Target
Name:
Angiotensin-converting enzyme
Synonyms:
ACE_MOUSE Dcp1
Type:
PROTEIN
Mol. Mass.:
150916.88
Organism:
Mus musculus
Description:
ChEMBL_34763
Residue:
1312
  
Inhibitor
Name:
BDBM50027518
Synonyms:
(2S)-2-[(2R)-2-[(carboxylatomethyl)amino]-3-phenylpropanamido]-4-methylpentanoate | CHEMBL2372593
Type:
Small organic molecule
Emp. Form.:
C17H24N2O5
Mol. Mass.:
336.3829
SMILES:
CC(C)C[C@H](NC(=O)[C@H](Cc1ccccc1)NCC(O)=O)C(O)=O
: