Target
Angiotensin-converting enzyme
Ligand
BDBM50027522
Substrate
Meas. Tech.
ChEBML_36914
IC50
>1000000±n/a nM
Citation
 Fournié-Zaluski, MCChaillet, PSoroca-Lucas, EMarçais-Collado, HCostentin, JRoques, BP New carboxyalkyl inhibitors of brain enkephalinase: synthesis, biological activity, and analgesic properties. J Med Chem 26:60-5 (1983)  
Target
Name:
Angiotensin-converting enzyme
Synonyms:
ACE_MOUSE Dcp1
Type:
PROTEIN
Mol. Mass.:
150916.88
Organism:
Mus musculus
Description:
ChEMBL_34763
Residue:
1312
  
Inhibitor
Name:
BDBM50027522
Synonyms:
2-(2-Carboxy-3-phenyl-propionylamino)-4-methyl-pentanoic acid
Type:
Small organic molecule
Emp. Form.:
C16H19NO5
Mol. Mass.:
305.3269
SMILES:
CC(C)CC(NC(=O)C(Cc1ccccc1)C([O-])=O)C([O-])=O
: