Target
Sulfotransferase 1E1
Ligand
BDBM50028411
Substrate
Meas. Tech.
ChEBML_67841
Ki
4300±n/a nM
Citation
 Iyer, VKButler, WBHorwitz, JPRozhin, JBrooks, SCCorombos, JKessel, D Some adenine and adenosine methylene-bridged estrogens. J Med Chem 26:162-6 (1983)  
Target
Name:
Sulfotransferase 1E1
Synonyms:
Estrogen sulfotransferase ST1E1 STE Sulfotransferase, estrogen-preferring
Type:
PROTEIN
Mol. Mass.:
34642.12
Organism:
Bos taurus
Description:
ChEMBL_67841
Residue:
295
  
Inhibitor
Name:
BDBM50028411
Synonyms:
3-Methoxy-13-methyl-4-nitro-6,7,8,9,11,12,13,14,15,16-decahydro-cyclopenta[a]phenanthren-17-one | CHEMBL43326
Type:
Small organic molecule
Emp. Form.:
C19H23NO4
Mol. Mass.:
329.3902
SMILES:
COc1ccc2[C@H]3CC[C@@]4(C)[C@@H](CCC4=O)[C@@H]3CCc2c1[N+]([O-])=O
: