Target
Sulfotransferase 1E1
Ligand
BDBM50367130
Substrate
Meas. Tech.
ChEBML_67841
Ki
32000±n/a nM
Citation
 Iyer, VKButler, WBHorwitz, JPRozhin, JBrooks, SCCorombos, JKessel, D Some adenine and adenosine methylene-bridged estrogens. J Med Chem 26:162-6 (1983)  
Target
Name:
Sulfotransferase 1E1
Synonyms:
Estrogen sulfotransferase ST1E1 STE Sulfotransferase, estrogen-preferring
Type:
PROTEIN
Mol. Mass.:
34642.12
Organism:
Bos taurus
Description:
ChEMBL_67841
Residue:
295
  
Inhibitor
Name:
BDBM50367130
Synonyms:
CHEMBL1628097
Type:
Small organic molecule
Emp. Form.:
C30H36N6O8
Mol. Mass.:
608.6422
SMILES:
C[C@]12CC[C@H]3[C@@H](CCc4c3ccc(OCCOC[C@H]3OC([C@H](O)[C@@H]3O)n3cnc5c(N)ncnc35)c4[N+]([O-])=O)[C@@H]1CCC2=O
: