Target
Sulfotransferase 1E1
Ligand
BDBM50404963
Substrate
Meas. Tech.
ChEBML_67841
Ki
140000±n/a nM
Citation
 Iyer, VKButler, WBHorwitz, JPRozhin, JBrooks, SCCorombos, JKessel, D Some adenine and adenosine methylene-bridged estrogens. J Med Chem 26:162-6 (1983)  
Target
Name:
Sulfotransferase 1E1
Synonyms:
Estrogen sulfotransferase ST1E1 STE Sulfotransferase, estrogen-preferring
Type:
PROTEIN
Mol. Mass.:
34642.12
Organism:
Bos taurus
Description:
ChEMBL_67841
Residue:
295
  
Inhibitor
Name:
BDBM50404963
Synonyms:
CHEMBL2067995
Type:
Small organic molecule
Emp. Form.:
C27H32N6O4
Mol. Mass.:
504.5808
SMILES:
C[C@]12CC[C@H]3[C@@H](CCc4c3ccc(OCCCCn3cnc5c(N)ncnc35)c4[N+]([O-])=O)[C@@H]1CCC2=O
: