Target
Sulfotransferase 1E1
Ligand
BDBM50404964
Substrate
Meas. Tech.
ChEBML_67841
Ki
250±n/a nM
Citation
 Iyer, VKButler, WBHorwitz, JPRozhin, JBrooks, SCCorombos, JKessel, D Some adenine and adenosine methylene-bridged estrogens. J Med Chem 26:162-6 (1983)  
Target
Name:
Sulfotransferase 1E1
Synonyms:
Estrogen sulfotransferase ST1E1 STE Sulfotransferase, estrogen-preferring
Type:
PROTEIN
Mol. Mass.:
34642.12
Organism:
Bos taurus
Description:
ChEMBL_67841
Residue:
295
  
Inhibitor
Name:
BDBM50404964
Synonyms:
CHEMBL2367720
Type:
Small organic molecule
Emp. Form.:
C28H35BrN5O14P3
Mol. Mass.:
838.428
SMILES:
[H][C@@]12CCC(=O)[C@@]1(C)CC[C@]1([H])c3ccc(OP(O)(=O)OP(O)(=O)OC[C@H]4O[C@H]([C@H](O)[C@@H]4OP(O)(O)=O)n4c(Br)nc5c(N)ncnc45)cc3CC[C@@]21[H]
: