Target
Sodium-dependent dopamine transporter
Ligand
BDBM50367137
Substrate
Meas. Tech.
ChEMBL_62002 (CHEMBL670185)
IC50
25±n/a nM
Citation
 Bøgesø, KP Neuroleptic activity and dopamine-uptake inhibition in 1-piperazino-3-phenylindans. J Med Chem 26:935-47 (1983)  
Target
Name:
Sodium-dependent dopamine transporter
Synonyms:
DA transporter SC6A3_RAT Sodium-dependent dopamine transporter | Sodium-dependent dopamine transporter (DAT)
Type:
Multi-pass membrane protein
Mol. Mass.:
68749.45
Organism:
Rattus norvegicus (rat)
Description:
P23977
Residue:
619
  
Inhibitor
Name:
BDBM50367137
Synonyms:
CHEMBL1203891
Type:
Small organic molecule
Emp. Form.:
C23H28F2N2O
Mol. Mass.:
386.478
SMILES:
OCCCCN1CCN(CC1)C1CC(c2ccc(F)cc12)c1ccc(F)cc1
: