Target
Sodium-dependent serotonin transporter
Ligand
BDBM50367137
Substrate
Meas. Tech.
ChEMBL_756 (CHEMBL615858)
IC50
610±n/a nM
Citation
 Bøgesø, KP Neuroleptic activity and dopamine-uptake inhibition in 1-piperazino-3-phenylindans. J Med Chem 26:935-47 (1983)  
Target
Name:
Sodium-dependent serotonin transporter
Synonyms:
5-HT Transporter 5HT transporter Anandamid membrane transporter, AMT Monoamine transporters; Norepinephrine & serotonin Slc6a4 Sodium-dependent serotonin transporter (SERT) | imipramine receptor
Type:
Multi-pass membrane protein
Mol. Mass.:
70168.43
Organism:
Rattus norvegicus (rat)
Description:
P31652
Residue:
630
  
Inhibitor
Name:
BDBM50367137
Synonyms:
CHEMBL1203891
Type:
Small organic molecule
Emp. Form.:
C23H28F2N2O
Mol. Mass.:
386.478
SMILES:
OCCCCN1CCN(CC1)C1CC(c2ccc(F)cc12)c1ccc(F)cc1
: