Target
Alpha-2A adrenergic receptor
Ligand
BDBM50026973
Substrate
Meas. Tech.
ChEBML_33039
Ki
330±n/a nM
Citation
 Remy, DCBritcher, SFKing, SWAnderson, PSHunt, CARandall, WCBélanger, PAtkinson, JGGirard, YRooney, CSFuentes, JJTotaro, JARobinson, JLRisley, EAWilliams, M Synthesis and receptor binding studies relevant to the neuroleptic activities of some 1-methyl-4-piperidylidene-9-substituted-pyrrolo[2,1-b][3]benzazepine derivatives. J Med Chem 26:974-80 (1983)  
Target
Name:
Alpha-2A adrenergic receptor
Synonyms:
ADA2A_BOVIN Alpha-2A adrenergic receptor Alpha-2A adrenoreceptor Alpha-2D adrenergic receptor Cerebral cortex alpha adrenergic receptor adrenergic Alpha2D
Type:
Enzyme Catalytic Domain
Mol. Mass.:
49275.13
Organism:
BOVINE
Description:
adrenergic Alpha2 0 BOVINE::Q28838
Residue:
452
  
Inhibitor
Name:
BDBM50026973
Synonyms:
11-(1-Methyl-piperidin-4-ylidene)-9-trifluoromethylsulfanyl-6,11-dihydro-5H-benzo[d]pyrrolo[1,2-a]azepine | CHEMBL368475
Type:
Small organic molecule
Emp. Form.:
C20H21F3N2S
Mol. Mass.:
378.454
SMILES:
[#6]-[#7]-1-[#6]-[#6]\[#6](-[#6]-[#6]-1)=[#6]-1/c2cccn2-[#6]-[#6]-c2ccc(-[#16]C(F)(F)F)cc-12
: