Target
Aminopeptidase N
Ligand
BDBM50017478
Substrate
Meas. Tech.
ChEMBL_35361 (CHEMBL647943)
Ki
20±n/a nM
Citation
 Rich, DHMoon, BJHarbeson, S Inhibition of aminopeptidases by amastatin and bestatin derivatives. Effect of inhibitor structure on slow-binding processes. J Med Chem 27:417-22 (1984)  
Target
Name:
Aminopeptidase N
Synonyms:
AMPN_PIG AP-M Alanyl aminopeptidase Aminopeptidase N (APN) Microsomal aminopeptidase pAPN
Type:
Protein
Mol. Mass.:
108810.25
Organism:
Sus scrofa (Pig)
Description:
P15145
Residue:
963
  
Inhibitor
Name:
BDBM50017478
Synonyms:
Amastatin Leu[1psi,CHOHCONH]ValValAsp | N-[(2S,3R)-3-amino-2-hydroxy-5-methylhexanoyl]-L-valyl-L-valyl-L-aspartic acid
Type:
Small organic molecule
Emp. Form.:
C21H38N4O8
Mol. Mass.:
474.5484
SMILES:
CC(C)C[C@@H](N)[C@H](O)C(=O)N[C@@H](C(C)C)C(=O)N[C@@H](C(C)C)C(=O)N[C@@H](CC(O)=O)C(O)=O
: