Target
Transporter
Ligand
BDBM50028277
Substrate
Meas. Tech.
ChEMBL_184434 (CHEMBL789206)
Ki
0.600000±n/a nM
Citation
 Maryanoff, BEMcComsey, DFCastanzo, MJSetler, PEGardocki, JFShank, RPSchneider, CR Pyrroloisoquinoline antidepressants. Potent, enantioselective inhibition of tetrabenazine-induced ptosis and neuronal uptake of norepinephrine, dopamine, and serotonin. J Med Chem 27:943-6 (1984)  
Target
Name:
Transporter
Synonyms:
Monoamine transporters; Norepininephrine & dopamine | Norepinephrine Monoamine transporters
Type:
PROTEIN
Mol. Mass.:
66787.87
Organism:
Rattus norvegicus
Description:
ChEMBL_1463061
Residue:
597
  
Inhibitor
Name:
BDBM50028277
Synonyms:
6-Phenyl-1,2,3,5,6,10b-hexahydro-pyrrolo[2,1-a]isoquinoline CHEMBL368088 | CHEMBL558387
Type:
Small organic molecule
Emp. Form.:
C18H19N
Mol. Mass.:
249.3502
SMILES:
[H][C@@]12CCCN1C[C@H](c1ccccc1)c1ccccc21
: