Target
Sodium-dependent dopamine transporter
Ligand
BDBM50028276
Substrate
Meas. Tech.
ChEBML_184435
Ki
0.990000±n/a nM
Citation
 Maryanoff, BEMcComsey, DFCastanzo, MJSetler, PEGardocki, JFShank, RPSchneider, CR Pyrroloisoquinoline antidepressants. Potent, enantioselective inhibition of tetrabenazine-induced ptosis and neuronal uptake of norepinephrine, dopamine, and serotonin. J Med Chem 27:943-6 (1984)  
Target
Name:
Sodium-dependent dopamine transporter
Synonyms:
DA transporter SC6A3_RAT Sodium-dependent dopamine transporter | Sodium-dependent dopamine transporter (DAT)
Type:
Multi-pass membrane protein
Mol. Mass.:
68749.45
Organism:
Rattus norvegicus (rat)
Description:
P23977
Residue:
619
  
Inhibitor
Name:
BDBM50028276
Synonyms:
6-(3,4-Dichloro-phenyl)-1,2,3,5,6,10b-hexahydro-pyrrolo[2,1-a]isoquinoline | CHEMBL171474
Type:
Small organic molecule
Emp. Form.:
C18H17Cl2N
Mol. Mass.:
318.24
SMILES:
Clc1ccc(cc1Cl)C1CN2CCC[C@H]2c2ccccc12
: