Target
Transporter
Ligand
BDBM50028280
Substrate
Meas. Tech.
ChEBML_184434
Ki
0.740000±n/a nM
Citation
 Maryanoff, BEMcComsey, DFCastanzo, MJSetler, PEGardocki, JFShank, RPSchneider, CR Pyrroloisoquinoline antidepressants. Potent, enantioselective inhibition of tetrabenazine-induced ptosis and neuronal uptake of norepinephrine, dopamine, and serotonin. J Med Chem 27:943-6 (1984)  
Target
Name:
Transporter
Synonyms:
Monoamine transporters; Norepininephrine & dopamine | Norepinephrine Monoamine transporters
Type:
PROTEIN
Mol. Mass.:
66787.87
Organism:
Rattus norvegicus
Description:
ChEMBL_1463061
Residue:
597
  
Inhibitor
Name:
BDBM50028280
Synonyms:
4-(1,2,3,5,6,10b-Hexahydro-pyrrolo[2,1-a]isoquinolin-6-yl)-phenol; hydrobromide | CHEMBL539081
Type:
Small organic molecule
Emp. Form.:
C18H19NO
Mol. Mass.:
265.3496
SMILES:
Oc1ccc(cc1)C1CN2CCC[C@H]2c2ccccc12
: